{"text_format":"1","workbook":"xlsx","n_sheets":7,"sheets":["READ ME","Hive Builder","Cost and Revenue Input","Payback Calc. (One-Product)","Payback Calc. (Multi-Product)","Profit_and_Loss","Price_List"],"not_rendered":{"charts":0,"images":0,"macros":1,"external_links":0,"defined_names":1,"comments":0,"pivot_tables":0},"unopened":[],"bounds":{"document_bytes":16777216,"sheet_cells":100000,"rows_first":2000,"rows_last":500,"rows_between":2000,"halvings":0,"cell_chars":16384,"cell_head_chars":4096},"cells_cut":0,"cells_raw":0,"read":"whole","date_system":"1900"}

{"sheet":"READ ME","index":0,"n_rows":0,"n_cols":0,"rows_kept":0,"cut":false,"hidden":false,"merged":[]}

{"sheet":"Hive Builder","index":1,"n_rows":98,"n_cols":14,"rows_kept":98,"cut":false,"hidden":false,"merged":[]}
[]
[null,"Product Name","Product Cost ","Quantity ","Total Product Cost ",null,null,"NOTE: This sheet assumes a single super deep bee management setup"]
[null,"10 frame outer cover (metal capped telescoping outer cover)",{"$f":"VLOOKUP(B3,Price_List!$B:$C,2,FALSE)","v":29.95},{"$f":"$H$10","v":0},{"$f":"SUM(Table1[[#This Row],[Product Cost ]]*Table1[[#This Row],[Quantity ]])","v":0}]
[null,"10 frame top feeder",{"$f":"VLOOKUP(B4,Price_List!$B:$C,2,FALSE)","v":33.950000000000003},0,{"$f":"SUM(Table1[[#This Row],[Product Cost ]]*Table1[[#This Row],[Quantity ]])","v":0}]
[null,"10 frame inner cover",{"$f":"VLOOKUP(B5,Price_List!$B:$C,2,FALSE)","v":17.95},0,{"$f":"SUM(Table1[[#This Row],[Product Cost ]]*Table1[[#This Row],[Quantity ]])","v":0}]
[null,"10 Frame Medium honey super assembled",{"$f":"VLOOKUP(B6,Price_List!$B:$C,2,FALSE)","v":25.95},0,{"$f":"SUM(Table1[[#This Row],[Product Cost ]]*Table1[[#This Row],[Quantity ]])","v":0}]
[null,"Assembled medium wood frame with plastic wax foundation",{"$f":"VLOOKUP(B7,Price_List!$B:$C,2,FALSE)","v":5.05},0,{"$f":"SUM(Table1[[#This Row],[Product Cost ]]*Table1[[#This Row],[Quantity ]])","v":0}]
[null,"Wooden Frame Metal Queen Excluder",{"$f":"VLOOKUP(B8,Price_List!$B:$C,2,FALSE)","v":22.95},0,{"$f":"SUM(Table1[[#This Row],[Product Cost ]]*Table1[[#This Row],[Quantity ]])","v":0}]
[null,"10 frame Deep Super brood chamber",{"$f":"VLOOKUP(B9,Price_List!$B:$C,2,FALSE)","v":27.95},0,{"$f":"SUM(Table1[[#This Row],[Product Cost ]]*Table1[[#This Row],[Quantity ]])","v":0},null,"Current Hives","Additional Hives"]
[null,"Assembled Deep wood frame with plastic wax foundation",{"$f":"VLOOKUP(B10,Price_List!$B:$C,2,FALSE)","v":5.15},0,{"$f":"SUM(Table1[[#This Row],[Product Cost ]]*Table1[[#This Row],[Quantity ]])","v":0},null,0,0]
[null,"10 frame solid bottom board",{"$f":"VLOOKUP(B11,Price_List!$B:$C,2,FALSE)","v":23.95},0,{"$f":"SUM(Table1[[#This Row],[Product Cost ]]*Table1[[#This Row],[Quantity ]])","v":0}]
[null,"10 frame hive stand",{"$f":"VLOOKUP(B12,Price_List!$B:$C,2,FALSE)","v":19.95},0,{"$f":"SUM(Table1[[#This Row],[Product Cost ]]*Table1[[#This Row],[Quantity ]])","v":0},null,null,null,{"$f":"M12","v":"Total"},"Per Hive",null,null,"Total","Per hive"]
[null,"10 frame entrance reducer",{"$f":"VLOOKUP(B13,Price_List!$B:$C,2,FALSE)","v":4.75},0,{"$f":"SUM(Table1[[#This Row],[Product Cost ]]*Table1[[#This Row],[Quantity ]])","v":0},null,null,"Woodenware cost",{"$f":"J13*H10","v":{"$error":"#DIV/0!"}},{"$f":"(SUM(Table1[[Total Product Cost ]])-SUM(E17:E20)-E15)/H10","v":{"$error":"#DIV/0!"}},null,null,{"$f":"J13*H10","v":{"$error":"#DIV/0!"}},{"$f":"J13","v":{"$error":"#DIV/0!"}}]
[null,"Galvanized Mouse Guard",{"$f":"VLOOKUP(B14,Price_List!$B:$C,2,FALSE)","v":7.95},0,{"$f":"SUM(Table1[[#This Row],[Product Cost ]]*Table1[[#This Row],[Quantity ]])","v":0},null,null,"Livestock/bee cost",{"$f":"J14*H10","v":{"$error":"#DIV/0!"}},{"$f":"(SUM(E17:E20)+E15)/H10","v":{"$error":"#DIV/0!"}},null,null,{"$f":"J14*H10","v":{"$error":"#DIV/0!"}},{"$f":"J14","v":{"$error":"#DIV/0!"}}]
[null,{"$f":"B17","v":"Local Bee Package"},{"$f":"C17","v":290},0,{"$f":"SUM(Table1[[#This Row],[Product Cost ]]*Table1[[#This Row],[Quantity ]])","v":0},null,null,"Construction cost",{"$f":"J15*H10","v":{"$error":"#DIV/0!"}},{"$f":"SUM(J13:J14)","v":{"$error":"#DIV/0!"}},null,null,{"$f":"J15*H10","v":{"$error":"#DIV/0!"}},{"$f":"SUM(N13:N14)","v":{"$error":"#DIV/0!"}}]
[null,"Livestock / Bees"]
[null,"Local Bee Package",{"$f":"VLOOKUP(B17,Price_List!$B:$C,2,FALSE)","v":290},0,{"$f":"SUM(Table1[[#This Row],[Product Cost ]]*Table1[[#This Row],[Quantity ]])","v":0}]
[null,"Nuc colony - 4 frame",{"$f":"VLOOKUP(B18,Price_List!$B:$C,2,FALSE)","v":275},0,{"$f":"SUM(Table1[[#This Row],[Product Cost ]]*Table1[[#This Row],[Quantity ]])","v":0}]
[null,"Imported Mated Queen",50,0,{"$f":"SUM(Table1[[#This Row],[Product Cost ]]*Table1[[#This Row],[Quantity ]])","v":0}]
[null,"Other",0,0,{"$f":"SUM(Table1[[#This Row],[Product Cost ]]*Table1[[#This Row],[Quantity ]])","v":0}]
[null,"Outer Covers "]
[null,"8-frame outer cover ",{"$f":"VLOOKUP(B22,Price_List!$B:$C,2,FALSE)","v":34.950000000000003},0,{"$f":"SUM(Table1[[#This Row],[Product Cost ]]*Table1[[#This Row],[Quantity ]])","v":0}]
[null,"Garden top hive cover with metal cap (8 or 10 frame)",{"$f":"VLOOKUP(B23,Price_List!$B:$C,2,FALSE)","v":55.95},0,{"$f":"SUM(Table1[[#This Row],[Product Cost ]]*Table1[[#This Row],[Quantity ]])","v":0}]
[null,"Garden top hive cover (no metal) **",{"$f":"VLOOKUP(B24,Price_List!$B:$C,2,FALSE)","v":39.950000000000003},0,{"$f":"SUM(Table1[[#This Row],[Product Cost ]]*Table1[[#This Row],[Quantity ]])","v":0}]
[null,"10 frame outer cover (metal capped telescoping outer cover)",{"$f":"VLOOKUP(B25,Price_List!$B:$C,2,FALSE)","v":29.95},0,{"$f":"SUM(Table1[[#This Row],[Product Cost ]]*Table1[[#This Row],[Quantity ]])","v":0}]
[null,"Metal Capped Telescoping Outer Cover**",{"$f":"VLOOKUP(B26,Price_List!$B:$C,2,FALSE)","v":29.95},0,{"$f":"SUM(Table1[[#This Row],[Product Cost ]]*Table1[[#This Row],[Quantity ]])","v":0}]
[null,"Other",0,0,{"$f":"SUM(Table1[[#This Row],[Product Cost ]]*Table1[[#This Row],[Quantity ]])","v":0}]
[null,"Inner Covers"]
[null,"8 – frame inner cover ",{"$f":"VLOOKUP(B29,Price_List!$B:$C,2,FALSE)","v":10.95},0,{"$f":"SUM(Table1[[#This Row],[Product Cost ]]*Table1[[#This Row],[Quantity ]])","v":0}]
[null,"10 frame inner cover",{"$f":"VLOOKUP(B30,Price_List!$B:$C,2,FALSE)","v":17.95},0,{"$f":"SUM(Table1[[#This Row],[Product Cost ]]*Table1[[#This Row],[Quantity ]])","v":0}]
{"$rows_left_out":69}
{"sheet":"Cost and Revenue Input","index":2,"n_rows":69,"n_cols":27,"rows_kept":69,"cut":false,"hidden":false,"merged":[[57,14,57,15],[56,14,56,15],[55,14,55,17],[42,10,42,12],[19,18,19,19],[20,18,20,19],[21,18,21,19],[22,18,22,19],[48,1,64,1],[2,6,2,22],[4,24,4,26],[48,14,48,15],[49,14,49,15],[2,2,2,4],[2,24,2,26],[11,18,11,22],[13,18,13,19],[15,18,15,19],[16,18,16,19],[17,18,17,19],[26,22,26,24],[42,14,42,18],[29,22,29,24],[18,18,18,19],[14,18,14,19],[0,2,0,24],[4,14,4,16],[4,10,4,12],[4,6,4,8],[4,2,4,4],[4,18,4,20]]}
[null,null,"Beekeeping Management Tool "]
[]
[null,null,"One-Time Costs ",null,null,null,"Operational Costs",null,null,null,null,null,null,null,null,null,null,null,null,null,null,null,null,null,"Miscellaneous Costs"]
[]
[null,null,"Fixed Costs (One-Time Costs)",null,null,null,"Mite Treatment ",null,null,null,"Feeding",null,null,null,"Pest Control ",null,null,null,"Fuel Costs",null,null,null,null,null,"Miscellaneous"]
[null,null,0,"Vented Bee Jacket ",{"$f":"C6*VLOOKUP(D6,Price_List!$B:$C,2,FALSE)","v":0},null,0,"Apistan strips – box of 10 ",{"$f":"G6*VLOOKUP(H6,Price_List!$B:$C,2,FALSE)","v":0},null,0,"2kg bag of Sugar (Walmart) ",{"$f":"K6*VLOOKUP(L6,Price_List!$B:$C,2,FALSE)","v":0},null,0,"Gallagher m60 fence Energizer ",{"$f":"O6*VLOOKUP(P6,Price_List!$B:$C,2,FALSE)","v":0},null,"Trip Distance (KM)",null,0,null,null,null,0,"Beginner kit ",{"$f":"Y6*VLOOKUP(Z6,Price_List!$B:$C,2,FALSE)","v":0}]
[null,null,0,"Bee Veil ",{"$f":"C7*VLOOKUP(D7,Price_List!$B:$C,2,FALSE)","v":0},null,0,"Apivar strips – 4 pack ",{"$f":"G7*VLOOKUP(H7,Price_List!$B:$C,2,FALSE)","v":0},null,0,"Ultra bee pollen pattie singles ",{"$f":"K7*VLOOKUP(L7,Price_List!$B:$C,2,FALSE)","v":0},null,0,"Gallagher M120 Fence Energizer",{"$f":"O7*VLOOKUP(P7,Price_List!$B:$C,2,FALSE)","v":0},null,"Trips per Week",null,0,null,null,null,0,"Standard kit ",{"$f":"Y7*VLOOKUP(Z7,Price_List!$B:$C,2,FALSE)","v":0}]
[null,null,0,"Bee Gloves (leather)",{"$f":"C8*VLOOKUP(D8,Price_List!$B:$C,2,FALSE)","v":0},null,0,"Apivar strips – 12 pack ",{"$f":"G8*VLOOKUP(H8,Price_List!$B:$C,2,FALSE)","v":0},null,0,"Ultra bee pollen pattie (40)",{"$f":"K8*VLOOKUP(L8,Price_List!$B:$C,2,FALSE)","v":0},null,0,"Gallagher s20 solar fence energizer ",{"$f":"O8*VLOOKUP(P8,Price_List!$B:$C,2,FALSE)","v":0},null,"Weeks ",null,0,null,null,null,0,"Deluxe Beginner Kit ",{"$f":"Y8*VLOOKUP(Z8,Price_List!$B:$C,2,FALSE)","v":0}]
[null,null,0,"Bee Gloves (cow skin)",{"$f":"C9*VLOOKUP(D9,Price_List!$B:$C,2,FALSE)","v":0},null,0,"Formic Pro Strips (2 doses)",{"$f":"G9*VLOOKUP(H9,Price_List!$B:$C,2,FALSE)","v":0},null,0,"Global Polen pattie ",{"$f":"K9*VLOOKUP(L9,Price_List!$B:$C,2,FALSE)","v":0},null,0,"Gallagher S40 Solar Fence Energizer",{"$f":"O9*VLOOKUP(P9,Price_List!$B:$C,2,FALSE)","v":0},null,"Gas/Fuel Price ($/L)",null,0,null,null,null,0,"Queen rearing frame ",{"$f":"Y9*VLOOKUP(Z9,Price_List!$B:$C,2,FALSE)","v":0}]
[null,null,0,"Bee Gloves (goat skin) ",{"$f":"C10*VLOOKUP(D10,Price_List!$B:$C,2,FALSE)","v":0},null,0,"Formic Pro Strips (10 doses)",{"$f":"G10*VLOOKUP(H10,Price_List!$B:$C,2,FALSE)","v":0},null,0,"Global pollen pattie (40)",{"$f":"K10*VLOOKUP(L10,Price_List!$B:$C,2,FALSE)","v":0},null,0,"Gallagher S100 Solar Fence Energizer",{"$f":"O10*VLOOKUP(P10,Price_List!$B:$C,2,FALSE)","v":0},null,"Fuel Efficiency (L/100KM)",null,0,null,null,null,0,"Wood cell bar ",{"$f":"Y10*VLOOKUP(Z10,Price_List!$B:$C,2,FALSE)","v":0}]
[null,null,0,"Hive tool ",{"$f":"C11*VLOOKUP(D11,Price_List!$B:$C,2,FALSE)","v":0},null,0,"Formic Pro Strips (30 doses)",{"$f":"G11*VLOOKUP(H11,Price_List!$B:$C,2,FALSE)","v":0},null,0,"Hive alive fondant patties ",{"$f":"K11*VLOOKUP(L11,Price_List!$B:$C,2,FALSE)","v":0},null,0,"Turbo wire 2.5mm ",{"$f":"O11*VLOOKUP(P11,Price_List!$B:$C,2,FALSE)","v":0},null,null,null,null,null,null,null,0,"Subcontract out honey extraction ",0]
[null,null,0,"Smoker & Shield (large)",{"$f":"C12*VLOOKUP(D12,Price_List!$B:$C,2,FALSE)","v":0},null,0,"Thymovar (10 count)",{"$f":"G12*VLOOKUP(H12,Price_List!$B:$C,2,FALSE)","v":0},null,0,"Pro Winter Feed - 10lb Bucket",{"$f":"K12*VLOOKUP(L12,Price_List!$B:$C,2,FALSE)","v":0},null,0,"Turbo Braid Wire - 400m",{"$f":"O12*VLOOKUP(P12,Price_List!$B:$C,2,FALSE)","v":0},null,"Labour ",null,null,null,null,null,0,"Imported Queen ",0]
[null,null,0,"Smoker & Shield (medium)",{"$f":"C13*VLOOKUP(D13,Price_List!$B:$C,2,FALSE)","v":0},null,0,"Oxalic Acid Dihydrate – 1 kg ",{"$f":"G13*VLOOKUP(H13,Price_List!$B:$C,2,FALSE)","v":0},null,0,"Pro winter feed 50 lb bucket ",{"$f":"K13*VLOOKUP(L13,Price_List!$B:$C,2,FALSE)","v":0},null,0,"Fibreglass Corner Posts",{"$f":"O13*VLOOKUP(P13,Price_List!$B:$C,2,FALSE)","v":0},null,"Employees ",null,"Wage/Hr","Hours","Total Cost ",null,0,"Bee Broker Services ",0]
[null,null,0,"Bee Brush ",{"$f":"C14*VLOOKUP(D14,Price_List!$B:$C,2,FALSE)","v":0},null,0,"Foric Acid jug – 1 L ",{"$f":"G14*VLOOKUP(H14,Price_List!$B:$C,2,FALSE)","v":0},null,0,"2:1 feeding syrup (23L /32 kg)",{"$f":"K14*VLOOKUP(L14,Price_List!$B:$C,2,FALSE)","v":0},null,0,"6' Grounding Rod",{"$f":"O14*VLOOKUP(P14,Price_List!$B:$C,2,FALSE)","v":0},null,"Matthew ",null,0,0,{"$f":"U14*V14","v":0},null,0,"Other (E.g. Transportation costs)",0]
[null,null,0,"Oxalic acid vaporizer ",{"$f":"C15*VLOOKUP(D15,Price_List!$B:$C,2,FALSE)","v":0},null,0,"Absorbent pads (<99)",{"$f":"G15*VLOOKUP(H15,Price_List!$B:$C,2,FALSE)","v":0},null,0,"Other",0,null,0,"Electric Fence Warning Sign",{"$f":"O15*VLOOKUP(P15,Price_List!$B:$C,2,FALSE)","v":0},null,"Employee #2",null,0,0,{"$f":"U15*V15","v":0}]
[null,null,0,"Varox vapouriser ",{"$f":"C16*VLOOKUP(D16,Price_List!$B:$C,2,FALSE)","v":0},null,0,"Absorbent pads (100-999)",{"$f":"G16*VLOOKUP(H16,Price_List!$B:$C,2,FALSE)","v":0},null,0,"Other",0,null,0,"Other",0,null,"Employee #3",null,0,0,0]
[null,null,0,"Respirator",{"$f":"C17*VLOOKUP(D17,Price_List!$B:$C,2,FALSE)","v":0},null,0,"Absorbent pads (>1000)",{"$f":"G17*VLOOKUP(H17,Price_List!$B:$C,2,FALSE)","v":0},null,0,"Other",0,null,null,null,null,null,"Employee #4",null,0,0,0]
[null,null,0,"Respirator replacement cartridges ",{"$f":"C18*VLOOKUP(D18,Price_List!$B:$C,2,FALSE)","v":0},null,0,"Varroa - Easy Check",{"$f":"G18*VLOOKUP(H18,Price_List!$B:$C,2,FALSE)","v":0},null,0,"Other",0,null,null,null,null,null,"Employee #5",null,0,0,0]
[null,null,0,"Turbo Uncapping Fork",{"$f":"C19*VLOOKUP(D19,Price_List!$B:$C,2,FALSE)","v":0},null,0,"Varroa sticky board ",{"$f":"G19*VLOOKUP(H19,Price_List!$B:$C,2,FALSE)","v":0},null,0,"Other",0,null,null,null,null,null,"Employee #6",null,0,0,0]
[null,null,0,"Drip extraction: hobbyist uncapping kit ",{"$f":"C20*VLOOKUP(D20,Price_List!$B:$C,2,FALSE)","v":0},null,0,"American foulbrood test kit ",{"$f":"G20*VLOOKUP(H20,Price_List!$B:$C,2,FALSE)","v":0},null,0,"Other",0,null,null,null,null,null,"Employee #7",null,0,0,0]
[null,null,0,"2-Frame Manual Hobby Extractor",{"$f":"C21*VLOOKUP(D21,Price_List!$B:$C,2,FALSE)","v":0},null,0,"European foulbrood Test kit ",{"$f":"G21*VLOOKUP(H21,Price_List!$B:$C,2,FALSE)","v":0},null,0,"Other",0,null,null,null,null,null,"Employee #8",null,0,0,0]
[null,null,0,"4-Frame Manual Hobby Extractor",{"$f":"C22*VLOOKUP(D22,Price_List!$B:$C,2,FALSE)","v":0},null,0,"Apistan strips – box of 100",{"$f":"G22*VLOOKUP(H22,Price_List!$B:$C,2,FALSE)","v":0},null,0,"Other",0,null,null,null,null,null,"Employee #9",null,0,0,0]
[null,null,0,"Maxant 3100H 9-Frame Hand Extractor",{"$f":"C23*VLOOKUP(D23,Price_List!$B:$C,2,FALSE)","v":0},null,0,"Apivar strips  – 60 pack ",{"$f":"G23*VLOOKUP(H23,Price_List!$B:$C,2,FALSE)","v":0},null,0,"Other",0,null,null,null,null,null,"Employee #10",null,0,0,0]
[null,null,0,"Maxant 3100P 9-Frame Extractor",{"$f":"C24*VLOOKUP(D24,Price_List!$B:$C,2,FALSE)","v":0},null,0,"Foric Acid jug – 20 L ",{"$f":"G24*VLOOKUP(H24,Price_List!$B:$C,2,FALSE)","v":0},null,0,"Other",0,null,null,null,null,null,"Total Wages Paid ",null,null,null,{"$f":"SUM(W14:W23)","v":0}]
[null,null,0,"Industry membership ",{"$f":"C25*VLOOKUP(D25,Price_List!$B:$C,2,FALSE)","v":0},null,0,"Other",0,null,0,"Other",0]
[null,null,0,"Hand dolly ",{"$f":"C26*VLOOKUP(D26,Price_List!$B:$C,2,FALSE)","v":0},null,0,"Other",0,null,0,"Other",0]
[null,null,0,"Folding hand truck",{"$f":"C27*VLOOKUP(D27,Price_List!$B:$C,2,FALSE)","v":0}]
[null,null,0,"Battery-operated vaporizer varrox eddy ",{"$f":"C28*VLOOKUP(D28,Price_List!$B:$C,2,FALSE)","v":0}]
[null,null,0,"OxaVap ProVap 110 Vaporizer",{"$f":"C29*VLOOKUP(D29,Price_List!$B:$C,2,FALSE)","v":0}]
[null,null,0,"OxaVap Cordless ProVap ",{"$f":"C30*VLOOKUP(D30,Price_List!$B:$C,2,FALSE)","v":0}]
{"$rows_left_out":40}
{"sheet":"Payback Calc. (One-Product)","index":3,"n_rows":50,"n_cols":18,"rows_kept":50,"cut":false,"hidden":false,"merged":[[39,1,39,2],[39,4,39,5]]}
[]
[]
[]
[null,"Product being sold: ",1,null,null,null,null,null,null,null,{"$f":"B8","v":"Nucleus Colonies"},null,null,null,null,null,null,{"$f":"B8","v":"Nucleus Colonies"}]
[null,null,null,null,null,null,null,null,null,null,"Pollination Services (per hive)",null,null,null,null,null,null,"Pollination Services (per hive)"]
[null,null,null,null,null,null,null,null,null,null,"Honey Production",null,null,null,null,null,null,"Honey Production"]
[null,"Product Prices (Per Unit)",null,null,null,null,null,null,null,null,"Full Colonies",null,null,null,null,null,null,"Full Colonies"]
[null,{"$f":"'Cost and Revenue Input'!O45","v":"Nucleus Colonies"},0,null,null,null,null,null,null,null,"Wax crafts - Candles",null,null,null,null,null,null,"Wax crafts - Candles"]
[null,{"$f":"CONCATENATE('Cost and Revenue Input'!O46,\" (per hive)\")","v":"Pollination Services (per hive)"},0,null,null,null,null,null,null,null,"Other",null,null,null,null,null,null,"Other"]
[null,{"$f":"'Cost and Revenue Input'!O47","v":"Honey Production"},0,null,null,null,null,null,null,null,"Variable cost per colony"]
[null,{"$f":"'Cost and Revenue Input'!O48","v":"Full Colonies"},0,null,null,null,null,null,null,null,"Variable cost per hive"]
[null,{"$f":"'Cost and Revenue Input'!O49","v":"Wax crafts - Candles"},0]
[null,{"$f":"'Cost and Revenue Input'!O50","v":"Other"},{"$f":"'Cost and Revenue Input'!R50","v":0}]
[]
[null,"Number of Hives Required for Each Additional Unit Of:",null,null,null,null,null,null,null,null,"Hives to break even"]
[null,"Pollination Hive",1,null,null,null,null,null,null,null,"Barrels to break even"]
[null,{"$f":"B8","v":"Nucleus Colonies"},0,null,null,null,null,null,null,null,"Colonies to break even"]
[null,"Pollination Services (per hive)",0,null,null,null,null,null,null,null,"Colonies to break even"]
[null,"Honey Production",0]
[null,"Full Colonies",0]
[null,"Wax crafts - Candles",0]
[null,"Other",0]
[]
[null,"Additional cost per unit of production not already captured:"]
[]
[null,{"$f":"'Cost and Revenue Input'!O45","v":"Nucleus Colonies"},{"$f":"'Cost and Revenue Input'!Q58","v":0}]
[null,{"$f":"'Cost and Revenue Input'!O46","v":"Pollination Services"},{"$f":"'Cost and Revenue Input'!Q59","v":0}]
[null,{"$f":"'Cost and Revenue Input'!O47","v":"Honey Production"},{"$f":"'Cost and Revenue Input'!Q60","v":0}]
[null,{"$f":"'Cost and Revenue Input'!O48","v":"Full Colonies"},{"$f":"'Cost and Revenue Input'!Q61","v":0}]
[null,{"$f":"'Cost and Revenue Input'!O49","v":"Wax crafts - Candles"},{"$f":"'Cost and Revenue Input'!Q62","v":0}]
{"$rows_left_out":21}
{"sheet":"Payback Calc. (Multi-Product)","index":4,"n_rows":25,"n_cols":5,"rows_kept":25,"cut":false,"hidden":false,"merged":[[12,2,12,3],[13,2,13,3]]}
[]
[]
[]
[null,"Product Name","Selling Price per Unit","Units sold","Annual Revenue"]
[null,{"$f":"'Cost and Revenue Input'!O45","v":"Nucleus Colonies"},{"$f":"'Cost and Revenue Input'!R45","v":0},{"$f":"'Cost and Revenue Input'!Q45","v":0},{"$f":"C5*D5","v":0}]
[null,{"$f":"'Cost and Revenue Input'!O46","v":"Pollination Services"},{"$f":"'Cost and Revenue Input'!R46","v":0},{"$f":"'Cost and Revenue Input'!Q46","v":0},0]
[null,{"$f":"'Cost and Revenue Input'!O47","v":"Honey Production"},{"$f":"'Cost and Revenue Input'!R47","v":0},{"$f":"'Cost and Revenue Input'!Q47","v":0},0]
[null,{"$f":"'Cost and Revenue Input'!O48","v":"Full Colonies"},{"$f":"'Cost and Revenue Input'!R48","v":0},{"$f":"'Cost and Revenue Input'!Q48","v":0},0]
[null,{"$f":"'Cost and Revenue Input'!O49","v":"Wax crafts - Candles"},{"$f":"'Cost and Revenue Input'!R49","v":0},{"$f":"'Cost and Revenue Input'!Q49","v":0},0]
[null,{"$f":"'Cost and Revenue Input'!O50","v":"Other"},{"$f":"'Cost and Revenue Input'!R50","v":0},{"$f":"'Cost and Revenue Input'!Q50","v":0},0]
[]
[]
[null,"Total Fixed Costs:",{"$f":"SUM('Cost and Revenue Input'!M44:M46)","v":{"$error":"#DIV/0!"}}]
[null,"Annual variable cost",{"$f":"'Payback Calc. (One-Product)'!C48","v":0}]
[]
[null,"Years to break-even",null,{"$f":"ROUNDUP(C13/(SUM(E5:E10)-C14),0)","v":{"$error":"#DIV/0!"}}]
[]
[]
[]
[null,{"$f":"CONCATENATE(\"Number of units of \",B6,\" to sell\")","v":"Number of units of Pollination Services to sell"},null,{"$f":"ROUNDUP(D5*$D$16,0)","v":{"$error":"#DIV/0!"}}]
[null,"Number of units of Honey Production to sell",null,{"$error":"#DIV/0!"}]
[null,"Number of units of Full Colonies to sell",null,{"$error":"#DIV/0!"}]
[null,"Number of units of Wax crafts - Candles to sell",null,{"$error":"#DIV/0!"}]
[null,"Number of units of Other to sell",null,{"$error":"#DIV/0!"}]
[null,"Number of units of  to sell",null,{"$error":"#DIV/0!"}]

{"sheet":"Profit_and_Loss","index":5,"n_rows":25,"n_cols":13,"rows_kept":25,"cut":false,"hidden":false,"merged":[]}
["Company Name and Year (E.g. Siri's Beekeeping 2024)"]
["Projected Profit & Loss"]
[{"$f":"_xlfn.CONCAT(\"Produced on \", TEXT(TODAY(), \"dd/mm/yyyy\"))","v":"Produced on 12/12/2023"}]
["Revenues"]
[{"$f":"'Cost and Revenue Input'!O45","v":"Nucleus Colonies"},null,null,null,null,{"$f":"'Cost and Revenue Input'!S45","v":0},null,null,null,null,null,"Total variable expenses per hive",{"$f":"F21 / 40","v":{"$error":"#DIV/0!"}}]
[{"$f":"'Cost and Revenue Input'!O46","v":"Pollination Services"},null,null,null,null,{"$f":"'Cost and Revenue Input'!S46","v":0},null,null,null,null,null,"Total fixed expenses per hive",{"$f":"F38 / 40","v":0}]
[{"$f":"'Cost and Revenue Input'!O47","v":"Honey Production"},null,null,null,null,{"$f":"'Cost and Revenue Input'!S47","v":0},null,null,null,null,null,"Total expenses per hive",{"$f":"M5 + M6","v":{"$error":"#DIV/0!"}}]
[{"$f":"'Cost and Revenue Input'!O48","v":"Full Colonies"},null,null,null,null,{"$f":"'Cost and Revenue Input'!S48","v":0}]
[{"$f":"'Cost and Revenue Input'!O49","v":"Wax crafts - Candles"},null,null,null,null,{"$f":"'Cost and Revenue Input'!S49","v":0}]
[{"$f":"'Cost and Revenue Input'!O50","v":"Other"},null,null,null,null,{"$f":"'Cost and Revenue Input'!S50","v":0}]
["Total Revenues",null,null,null,null,{"$f":"SUM(F5:F10)","v":0}]
[]
["Expenses (Variable)"]
[{"$f":"'Cost and Revenue Input'!G5","v":"Mite Treatment "},null,null,null,null,{"$f":"'Cost and Revenue Input'!M47","v":0}]
[{"$f":"'Cost and Revenue Input'!K5","v":"Feeding"},null,null,null,null,{"$f":"'Cost and Revenue Input'!M48","v":0}]
[{"$f":"'Cost and Revenue Input'!O5","v":"Pest Control "},null,null,null,null,{"$f":"'Cost and Revenue Input'!M49","v":0}]
[{"$f":"'Cost and Revenue Input'!S5","v":"Fuel Costs"},null,null,null,null,{"$f":"'Cost and Revenue Input'!M50","v":0}]
[{"$f":"'Cost and Revenue Input'!S12","v":"Labour "},null,null,null,null,{"$f":"'Cost and Revenue Input'!M51","v":0}]
[{"$f":"'Cost and Revenue Input'!Y5","v":"Miscellaneous"},null,null,null,null,{"$f":"'Cost and Revenue Input'!M52","v":0}]
["Product-specific variable costs",null,null,null,null,{"$f":"'Cost and Revenue Input'!M53","v":{"$error":"#DIV/0!"}}]
["Total Variable Expenses",null,null,null,null,{"$f":"SUM(F14:F20)","v":{"$error":"#DIV/0!"}}]
[]
["Expenses (Fixed)",null,null,"Total Cost","# Of years of Use","Amount allocated to this year"]
[{"$f":"'Hive Builder'!H13","v":"Woodenware cost"},null,null,{"$f":"'Hive Builder'!M13","v":{"$error":"#DIV/0!"}},null,{"$f":"D24/E24","v":{"$error":"#DIV/0!"}}]
[{"$f":"'Hive Builder'!H14","v":"Livestock/bee cost"},null,null,{"$f":"'Hive Builder'!M14","v":{"$error":"#DIV/0!"}},null,{"$error":"#DIV/0!"}]

{"sheet":"Price_List","index":6,"n_rows":169,"n_cols":3,"rows_kept":169,"cut":false,"hidden":false,"merged":[]}
["ID","Product Name","Cost"]
[null,"Fixed Costs"]
[1,"Vented Bee Jacket ",159.94999999999999]
[2,"Bee Veil ",33.950000000000003]
[3,"Bee Gloves (leather)",23.95]
[4,"Bee Gloves (cow skin)",36.950000000000003]
[5,"Bee Gloves (goat skin) ",38.25]
[6,"Hive tool ",9.9499999999999993]
[7,"Smoker & Shield (large)",46.95]
[8,"Smoker & Shield (medium)",39.950000000000003]
[9,"Bee Brush ",7.95]
[10,"Oxalic acid vaporizer ",119.95]
[11,"Varox vapouriser ",224.05]
[12,"Respirator",79.95]
[13,"Respirator replacement cartridges ",34.950000000000003]
[14,"Turbo Uncapping Fork",35.950000000000003]
[15,"Drip extraction: hobbyist uncapping kit ",229.95]
[16,"2-Frame Manual Hobby Extractor",385.99]
[17,"4-Frame Manual Hobby Extractor",485.99]
[18,"Maxant 3100H 9-Frame Hand Extractor",995]
[19,"Maxant 3100P 9-Frame Extractor",1595]
[20,"Industry membership ",115]
[21,"Hand dolly ",118]
[22,"Folding hand truck",79]
[23,"Battery-operated vaporizer varrox eddy ",729.95]
[24,"OxaVap ProVap 110 Vaporizer",735.95]
[25,"OxaVap Cordless ProVap ",854.95]
[26,"OxaVap ProVap EZ 110 vaporizer ",1095.95]
[27,"Maxant Mobile Uncapping Tank ",1995]
[28,"Maxant 1400PL Extractor ",2895]
{"$rows_left_out":139}